{"text_format":"1","workbook":"xlsx","n_sheets":2,"sheets":["Cadastro","Dados automáticos"],"not_rendered":{"charts":0,"images":16,"macros":1,"external_links":0,"defined_names":0,"comments":0,"pivot_tables":0},"unopened":[],"bounds":{"document_bytes":16777216,"sheet_cells":100000,"rows_first":2000,"rows_last":500,"rows_between":2000,"halvings":0,"cell_chars":16384,"cell_head_chars":4096},"cells_cut":0,"cells_raw":0,"read":"whole","date_system":"1900"}

{"sheet":"Cadastro","index":0,"n_rows":36,"n_cols":29,"rows_kept":36,"cut":false,"hidden":false,"merged":[[28,0,28,1],[20,4,20,5],[25,4,25,5],[12,3,12,5],[14,4,14,5],[27,2,31,2],[27,3,31,20],[10,19,26,20],[7,0,7,1],[7,2,7,20],[8,3,8,20],[9,3,9,20],[0,1,6,2]]}
[null,"FICHA CADASTRAL - PROBELLE"]
[]
[]
[]
[]
[]
[]
["Dados do Cliente",null,"Dados do Representante"]
["Nome da Empresa PROBELLE*:",null,"Nome RCA: ",{"$f":"IF(Z31<=0,\"\",Z31)","v":""}]
["CNPJ: ",{"$f":"Z13","v":""},"Cód RCA: ",null,null,null,null,null,null,null,null,null,null,null,null,null,null,null,null,null,null,null,null,null,"Manual","Auto"]
["Nome Fantasia",null,null,null,null,null,null,null,null,null,null,null,null,null,null,null,null,null,null,"Copyright 2023. Todos os direitos reservados.",null,null,null,"Empresa Probelle",null,null,null,"SIM"]
["Endereço: ",null,null,null,null,null,null,null,null,null,null,null,null,null,null,null,null,null,null,null,null,null,null,"Nome Fantasia: ",null,null,null,"NÃO"]
["Complemento: ",null,null,null,null,null,null,null,null,null,null,null,null,null,null,null,null,null,null,null,null,null,null,"CNPJ: ","Ok",{"$f":"IFERROR(VLOOKUP(B9,'Dados automáticos'!A1:C11,3,0),\"\")","v":""}]
["Telefone: ",null,null,null,null,null,null,null,null,null,null,null,null,null,null,null,null,null,null,null,null,null,null,"Nome da Empresa:"]
["CNPJ CLIENTE*: ",null,"Gerar PDF",null,"Consultar CEP",null,null,null,null,null,null,null,null,null,null,null,null,null,null,null,null,null,null,"Endereço: "]
["Inscrisão Estatual*: ",null,null,null,null,null,null,null,null,null,null,null,null,null,null,null,null,null,null,null,null,null,null,"Complemento: ",null,null,null,"UF",{"$f":"IFERROR(VLOOKUP(Z13,'Dados automáticos'!C1:D11,2,0),\"\")","v":""}]
["Cód Suframa: ",null,null,null,null,null,null,null,null,null,null,null,null,null,null,null,null,null,null,null,null,null,null,"Telefone: "]
["E-mail*: ",null,null,null,null,null,null,null,null,null,null,null,null,null,null,null,null,null,null,null,null,null,null,"CNPJ: "]
["Contato: ",null,null,null,null,null,null,null,null,null,null,null,null,null,null,null,null,null,null,null,null,null,null,"Inscrisão Estatual: "]
["CNPJ Matriz: ",null,null,null,null,null,null,null,null,null,null,null,null,null,null,null,null,null,null,null,null,null,null,"Cód Suframa: "]
["SIMPLES NACIONAL:",null,"Salvar",null,"Excel & E-mail",null,null,null,null,null,null,null,null,null,null,null,null,null,null,null,null,null,null,"E-mail "]
["Canal*:",null,null,null,null,null,null,null,null,null,null,null,null,null,null,null,null,null,null,null,null,null,null,"CNPJ Matriz: "]
["Equipe:",null,null,null,null,null,null,null,null,null,null,null,null,null,null,null,null,null,null,null,null,null,null,"SIMPLES NACIONAL:"]
["Rede*:",null,null,null,null,null,null,null,null,null,null,null,null,null,null,null,null,null,null,null,null,null,null,"Condição de Pagamento: "]
["Gerente Comercial:",null,null,null,null,null,null,null,null,null,null,null,null,null,null,null,null,null,null,null,null,null,null,"Contato: "]
["Telefone: ",null,"Imprimir",null,"PDF & E-mail",null,null,null,null,null,null,null,null,null,null,null,null,null,null,null,null,null,null,"Endereço:"]
["Fale Conosco","Enviar E-mail - Equipe Comercial",null,null,null,null,null,null,null,null,null,null,null,null,null,null,null,null,null,null,null,null,null,"Complemento: "]
["Data: ",{"$f":"TODAY()","v":"2024-06-06"},null,"Portal Probelle",null,null,null,null,null,null,null,null,null,null,null,null,null,null,null,null,null,null,null,"Telefone: "]
["Dados Fiscais",null,null,null,null,null,null,null,null,null,null,null,null,null,null,null,null,null,null,null,null,null,null,"E-mail:"]
["BENEFÍCIOS FISCAIS : ",null,null,null,null,null,null,null,null,null,null,null,null,null,null,null,null,null,null,null,null,null,null,"DATA: "]
["NUMERO DA SUFRAMA : ",null,null,null,null,null,null,null,null,null,null,null,null,null,null,null,null,null,null,null,null,null,null,"Nome RCA: ",{"$f":"IFERROR(VLOOKUP(D10,'Dados automáticos'!F1:G97,2,0),)","v":0},{"$f":"Y31","v":0}]
["TIPO FISCAL CLIENTE : ",null,null,null,null,null,null,null,null,null,null,null,null,null,null,null,null,null,null,null,null,null,null,"Cód RCA: "]
["OUTRAS INFORMAÇÕES : ",null,null,null,null,null,null,null,null,null,null,null,null,null,null,null,null,null,null,null,null,null,null,"BENEFÍCIOS FISCAIS"]
[null,null,null,null,null,null,null,null,null,null,null,null,null,null,null,null,null,null,null,null,null,null,null,"NUMERO DA SUFRAMA : "]
[null,null,null,null,null,null,null,null,null,null,null,null,null,null,null,null,null,null,null,null,null,null,null,"TIPO FISCAL CLIENTE : "]
[null,null,null,null,null,null,null,null,null,null,null,null,null,null,null,null,null,null,null,null,null,null,null,"OUTRAS INFORMAÇÕES"]

{"sheet":"Dados automáticos","index":1,"n_rows":97,"n_cols":11,"rows_kept":97,"cut":false,"hidden":true,"merged":[]}
["Empresas","COD","CNPJ","UF",null,"COD","RCA","COD","CNPJ / COD","E-MAIL","UF"]
["PROBELLE COSMETICA PROFISSIONAIS LTDA ME",100,"12.669.929/0001-97","RJ",null,10354,"RCA  MONICA PRATA",10354,"05.490.407/0001-68","monica.r.prata@globo.com","AM"]
["MEGA VITAL",200,"15.569.959/0001-10","RJ",null,7883,"RCA ADELSON",7883,"35.480.943/0001-43","adelson_p1@hotmail.com","SP"]
["MEGA RIO SUL COMERCIO DE COSMETICOS EIRELI",300,"23.098.469/0001-00","RJ",null,6160,"RCA ADILSON",6160,"32.683.250/0001-60","vendas.mg@probelle.com.br","MG"]
["PRO SP COMERCIO DE COSMETICOS - EIRELI",400,"28.648.704/0001-94","SP",null,10104,"RCA ADRIANA BEIRÃO",10104,"__.___.___/____-__",null,"PE"]
["PSD COMERCIO DE COSMETICOS EIRELI",500,"22.338.211/0001-71","SP",null,2974,"RCA ADRIANA STRACI RIBEIRO",2974,"07.348.450/0001-19","adrianastracci@uol.com.br","SP"]
["UNI MEGA DISTRIBUIDORA DE COSMETICOS MINEIRA EIRELI",600,"29.895.829/0001-81","MG",null,11100,"RCA ADRIEL",11100,"__.___.___/____-__","ativerepresentacao@gmail.com","MG"]
["UNIVERSAL DISTRIBUIDORA DE COSMETICOS PARANAENSE LTDA",700,"32.812.255/0001-45","PR",null,6996,"RCA ALEXANDRE WANDERLEY",6996,"38.179.328/0001-90","ledita.representacoes@gmail.com","RJ"]
["SUPER PODEROSA COMERCIO DE COSMETICOS LTDA",800,"33.648.842/0001-03","ES",null,10653,"RCA ALVARO VAZ MOTA",10653,"05.160.187/0001-04","alvaro.motarepresentacoes@gmail.com","RO"]
["PARALELO SUL RIO GRANDENSE COMERCIO DE COSMETICOS LTDA",950,"40.212.118/0001-06","RS",null,2641,"RCA ANA",2641,"29.132.870/0001-04","batistaenunes.rep@hotmail.com","PI"]
["COMERCIAL SMART MINEIRA DISTRIBUIDORA DE COSMETICOS LTDA",960,"45.195.142/0001-90","MG",null,5250,"RCA ANDERSON JURKEVICZ",5250,"14.333.375/0001-88","andjurkevicz@hotmail.com","PR"]
[null,null,null,null,null,6296,"RCA ANDRE MORAES",6296,"20.965.084/0001-05","andremoraes@amxrepresentacoes.com","RJ"]
[null,null,null,null,null,7018,"RCA ANDREA VERISSIMO",7018,"42.673.150/0001-06","verissimo.a@gmail.com","SP"]
[null,null,null,null,null,7342,"RCA ANTONIA PALHETA",7342,"84.510.197/0001-07",null,"AM"]
[null,null,null,null,null,7832,"RCA ANTONIO JOSÉ",7832,"28.743.630/0001-75","ledacontabilidadefortaleza@gmail.com","CE"]
[null,null,null,null,null,10310,"RCA ANTONIO VALDECI",10310,"25.219.860/0001-41",null,"CE"]
[null,null,null,null,null,7906,"RCA ARNALDO JUNIOR",7906,"07.857.016/0001-64","sledzcarlos@uol.com.br","MT"]
[null,null,null,null,null,10101,"RCA CARLOS EDUARDO",10101,"07.981.904/0001-94","gabriell@ronaconsultoriacontabil.com.br","TO"]
[null,null,null,null,null,6315,"RCA CARLOS ELY",6315,"14.937.887/0001-53","ely.vendas@uol.com.br","SP"]
[null,null,null,null,null,5249,"RCA CARLOS EVERALDO",5249,"34.456.881/0001-71","carloseveraldo@yahoo.com.br","SC"]
[null,null,null,null,null,7406,"RCA CARMEN DOLORES",7406,"17.056.377/0001-65","savoycontabil@terra.com.br","SP"]
[null,null,null,null,null,2510,"RCA CECILIA DOS SANTOS",2510,"07.698.605/0001-47","DOS.CECI@hotmail.com","SP"]
[null,null,null,null,null,6993,"RCA CESAR JUNIOR",6993,"26.109.330/0001-03","ecediltda@yahoo.com.br","MG"]
[null,null,null,null,null,5390,"RCA CLAUDIO MALTA",5390,"04.162.724/0001-92","claudiomalta7@gmail.com","SP"]
[null,null,null,null,null,6981,"RCA CRISTIANO SWOT",6981,"26.794.992/0001-60","swot.representacoes@gmail.com","RS"]
[null,null,null,null,null,11110,"RCA CRISTINA FEMGILI MARTINEZ",11110,"28.393.019/0001-64","cristina.martinez@probelle.com.br","SP"]
[null,null,null,null,null,6314,"RCA DANIEL HENRIQUE LOBREGAT",6314,"18.041.490/0001-30","daniel.henrique.lobregat@hotmail.com","SP"]
[null,null,null,null,null,7823,"RCA DANIEL KENDI",7823,"44.474.417/0001-61","dktominaga@gmail.com","SP"]
[null,null,null,null,null,6964,"RCA DANIELE FERREIRA DA SILVA",6964,"6964","danielefer120@gmail.com","SP"]
[null,null,null,null,null,5332,"RCA EDUARDO UETI",5332,"18.359.566/0001-70","eduardo-ueti@hotmail.com","SP"]
[null,null,null,null,null,7663,"RCA ELTON MELLADO",7663,"36.180.877/0001-59","eltonmellado@yahoo.com.br","RJ"]
[null,null,null,null,null,5259,"RCA EMERSON PEREIRA",5259,"42.817.163/0001-01","emersonps415@hotmail.com","MG"]
[null,null,null,null,null,6294,"RCA EVANDRO TRAJANO",6294,"37.144.421/0001-04","comercialtrajano@gmail.com","SP"]
[null,null,null,null,null,7368,"RCA FABIANO LITTIERE",7368,"29.936.896/0001-05","fabiano.littiere@gmail.com","MG"]
[null,null,null,null,null,5328,"RCA FABIO MALTA",5328,"26.846.621/0001-84","fabiomalta.representacao@gmail.com","SP"]
[null,null,null,null,null,6465,"RCA FRED CORDEIRO",6465,"20.356.149/0001-15","fred12.rj@hotmail.com","RJ"]
[null,null,null,null,null,7644,"RCA GASPARETE",7644,"10.942.331/0001-02","gaspareterepresentacoes@yahoo.com.br","MG"]
[null,null,null,null,null,7028,"RCA GILCELIA - GIL",7028,"41.987.019/0001-50","gil@agsrepresentacoes.net.br","BA"]
[null,null,null,null,null,6469,"RCA GILMAR LAGOS",6469,"6469","gilmarlagos@gmail.com","RJ"]
[null,null,null,null,null,10083,"RCA GILSON GUSMÃO",10083,"13.326.967/0001-00","dalvadisiocontabilidade@hotmail.com","BA"]
[null,null,null,null,null,6468,"RCA GILSON LUDIMAR",6468,"38.657.013/0001-00","gilsonmuitolindo@terra.com.br","RJ"]
[null,null,null,null,null,6978,"RCA GUIRLAN CAVALCANTE",6978,"29.616.384/0001-53","guirlan@hotmail.com","CE"]
[null,null,null,null,null,7462,"RCA GUSTAVO GIL",7462,"10.453.038/0001-73","gustavohgil@yahoo.com.br","MG"]
[null,null,null,null,null,6297,"RCA HELIDA LINHARES",6297,"04.939.545/0001-19","helidalinharesafonso@gmail.com","SP"]
[null,null,null,null,null,8022,"RCA IDEUSMAR",8022,"40.296.879/0001-85","ideusmarsilva46@gmail.com","CE"]
[null,null,null,null,null,2976,"RCA JADE MANUEL",2976,"32.812.279/0001-02","jadem.comercial@hotmail.com","RJ"]
[null,null,null,null,null,5241,"RCA JAIR DOS REIS",5241,"01.745.007/0001-03","jjreirep@gmail.com","MG"]
[null,null,null,null,null,10106,"RCA JEAN DE LIMA",10106,"10106",null,"AL"]
[null,null,null,null,null,7682,"RCA JELUART",7682,"28.580.615/0001-53","pericia.contabil@hotmail.com","RS"]
[null,null,null,null,null,6994,"RCA JOAQUIM BANHOS",6994,"09.148.359/0001-85","j.banhos@yahoo.com.br","CE"]
[null,null,null,null,null,11111,"RCA JOHNSON LUIGI",11111,"12.682.435/0001-42","johnsonluigi@probelle.com.br","RJ"]
[null,null,null,null,null,6300,"RCA JOSE AUGUSTO",6300,"36.308.963/0001-02","pro-higensrep@uol.com.br","ES"]
[null,null,null,null,null,6305,"RCA JOSE CARLOS",6305,"22.808.548/0001-03","jcrocha.rj@uol.com.br","RJ"]
[null,null,null,null,null,6470,"RCA JOSE LUIZ",6470,"6470","zeluizrepresentante@hotmail.com","RJ"]
[null,null,null,null,null,6474,"RCA JOSE MARTINS",6474,"11.358.110/0001-46","jhamartins@gmail.com","RJ"]
[null,null,null,null,null,2882,"RCA JULIANA BARBOSA",2882,"32.959.956/0001-01","julianabarbosa753@gmail.com","GO"]
[null,null,null,null,null,6237,"RCA JULIANA GONÇALVES",6237,"6237",null,"SP"]
[null,null,null,null,null,7292,"RCA JUNIOR AGUIAR",7292,"24.059.842/0001-87","ac.aguiar.junior@hotmail.com","MG"]
[null,null,null,null,null,10490,"RCA KARINA GONÇALVES",10490,"42.678.655/0001-63","karinagoncalves.probelle@gmail.com","SP"]
[null,null,null,null,null,6466,"RCA LAERCIO LOPES",6466,"27.477.244/0001-16","contatolaerciopro@gmail.com","RJ"]
[null,null,null,null,null,6299,"RCA LARANJEIRA",6299,"20.556.433/0001-35","representacoeslaranjeira@gmail.com","MG"]
[null,null,null,null,null,2860,"RCA LEANDRO RAMOS",2860,"14.489.301/0001-35","leandro.representacoes@yahoo.com.br","BA"]
[null,null,null,null,null,6306,"RCA LUCIANO LEANDRO BRAGA",6306,"30.836.138/0001-96","lucianolsbraga@yahoo.com.br","SP"]
[null,null,null,null,null,6472,"RCA LUIZ CLAUDIO LOURENÇO",6472,"6472","luiznlgfilhos@gmail.com","RJ"]
[null,null,null,null,null,10316,"RCA LUIZ EDMUNDO",10316,"05.267.963/0001-70","edmundo@edmundorepresentacoes.com.br","AC"]
[null,null,null,null,null,7464,"RCA MANOEL COUTINHO",7464,"15.648.567/0001-46","mmessiascoutinho@gmail.com","RJ"]
[null,null,null,null,null,7732,"RCA MANUEL JOÃO",7732,"7732",null,"RJ"]
[null,null,null,null,null,6319,"RCA MARCIA",6319,"10.765.393/0001-88","marciavf09@gmail.com","RJ"]
[null,null,null,null,null,6995,"RCA MARCIO NOGUEIRA",6995,"07.488.890/0001-71","orcarepre@gmail.com","MG"]
[null,null,null,null,null,6317,"RCA MARCO ANTONIO MOZEM",6317,"01.518.898/0001-57","rogeriopontocerto@bol.com.br","SP"]
[null,null,null,null,null,6991,"RCA MARCO DE PAULA",6991,"34.030.614/0001-38","comercial1@depaularepresentacoes.com","MG"]
[null,null,null,null,null,5248,"RCA MARCO LEITE",5248,"30.183.056/0001-90","raquelrepsul@gmail.com","RS"]
[null,null,null,null,null,5251,"RCA MARIA IZABEL E RENOLFO",5251,"32.181.953/0001-90",null,"AM"]
[null,null,null,null,null,10318,"RCA MARIA LILIANE",10318,"45.623.882/0001-80","lila@dismelo.com.br","PA"]
[null,null,null,null,null,5819,"RCA MARILZA ALMEIDA",5819,"11.260.738/0001-04","mbgcarioca@gmail.com","RJ"]
[null,null,null,null,null,6921,"RCA MARIO LUIZ",6921,"91.3__.837/847_-68","mariotostes.queiroz@gmail.com","RJ"]
[null,null,null,null,null,10322,"RCA NAILSON FERREIRA",10322,"10322","nailsonfc@ig.com.br","AM"]
[null,null,null,null,null,7389,"RCA PATRICIA CALIL",7389,"07.273.638/0001-45","administra@tramcontabil.com","MG"]
[null,null,null,null,null,10326,"RCA RAFAEL CALASANS",10326,"15.094.071/0001-78",null,"SE"]
[null,null,null,null,null,6316,"RCA RAFAEL RANGEL",6316,"34.050.964/0001-66","rrlopes.representacoes@gmail.com","SP"]
[null,null,null,null,null,2961,"RCA RAFAELA GONÇALVES",2961,"29.888.619/0001-66","rafaelag.costa@hotmail.com","MA"]
[null,null,null,null,null,6304,"RCA RAQUEL SOUZA",6304,"11.295.621/0001-66","raquell_souza@yahoo.com.br","RJ"]
[null,null,null,null,null,7357,"RCA RENAN PRADO",7357,"7357","renanpenarandaprado@gmail.com","SP"]
[null,null,null,null,null,5820,"RCA RODRIGO MOURA",5820,"08.289.401/0001-15","rodrigo.moura28@gmail.com","RJ"]
[null,null,null,null,null,2869,"RCA ROGERIO SOUZA",2869,"08.381.753/0001-04","rogerio.representacoes@yahoo.com.br","MG"]
[null,null,null,null,null,6503,"RCA RONALDO DE SOUSA",6503,"40.083.481/0001-60","comercial.aguia.rio@gmail.com","RJ"]
[null,null,null,null,null,7390,"RCA ROSANGELA A. - MUSA REPRESENTAÇÕES",7390,"43.981.469/0001-61","rose.moreno@outlook.com.br","SP"]
[null,null,null,null,null,7713,"RCA ROSINALDO ALVES",7713,"04.464.270/0001-04","nailsonfc@ig.com.br","AM"]
[null,null,null,null,null,5585,"RCA SILVANA E CLAUDIO",5585,"12.566.073/0001-24","sim.cardoso8@gmail.com","RJ"]
[null,null,null,null,null,6295,"RCA SILVIA CARBONE",6295,"10.724.614/0001-70","carbonesilvia10@gmail.com","SP"]
[null,null,null,null,null,6997,"RCA TIAGO CARVALHO",6997,"07.179.791/0001-08","tiagocarvalhofare@hotmail.com","PE"]
[null,null,null,null,null,8012,"RCA ULISSES DE CASTRO",8012,"03.972.388/0001-80","joulyrepres@uol.com.br","GO"]
[null,null,null,null,null,2865,"RCA VILSON RIBEIRO",2865,"18.965.885/0001-29","ribeiro.vilson@uol.com.br","PR"]
[null,null,null,null,null,6471,"RCA VITANGELO",6471,"6471","vitangelo@probelle.com.br","RJ"]
[null,null,null,null,null,6467,"RCA WAGNER VASQUES",6467,"02.130.942/0001-10","w.vasquesrep@yahoo.com.br","RJ"]
[null,null,null,null,null,10020,"RCA WILSON RAMOS",10020,"27.408.324/0001-10","wrorepresentacao@gmail.com","SP"]
[null,null,null,null,null,7427,"RCA WILTON BRITTO",7427,"09.214.815/0001-48","wiltonbrito180@gmail.com","BA"]